Target
Beta-mannosidase
Ligand
BDBM50186734
Substrate
Meas. Tech.
ChEMBL_353431 (CHEMBL865091)
pH
4±n/a
Ki
>1000000±n/a nM
Comments
extracted
Citation
 Wang, RWQiu, XLBols, MOrtega-Caballero, FQing, FL Synthesis and biological evaluation of glycosidase inhibitors: gem-difluoromethylenated nojirimycin analogues. J Med Chem 49:2989-97 (2006)  
Target
Name:
Beta-mannosidase
Synonyms:
Lysosomal beta A mannosidase MANBA Mannanase | Mannase
Type:
PROTEIN
Mol. Mass.:
100878.33
Organism:
Homo sapiens (Human)
Description:
ChEMBL_41367
Residue:
879
  
Inhibitor
Name:
BDBM50186734
Synonyms:
CHEMBL207910 | D-1,4-dideoxy-4,4-difluoronojirimycin
Type:
Small organic molecule
Emp. Form.:
C6H11F2NO3
Mol. Mass.:
183.1532
SMILES:
OC[C@H]1NC[C@H](O)[C@@H](O)C1(F)F
: