Target
Beta-glucosidase
Ligand
BDBM50186736
Substrate
Meas. Tech.
ChEMBL_353428 (CHEMBL870034)
pH
6.8±n/a
Ki
>1000000±n/a nM
Comments
extracted
Citation
 Wang, RWQiu, XLBols, MOrtega-Caballero, FQing, FL Synthesis and biological evaluation of glycosidase inhibitors: gem-difluoromethylenated nojirimycin analogues. J Med Chem 49:2989-97 (2006)  
Target
Name:
Beta-glucosidase
Synonyms:
BGLS_WICAO
Type:
PROTEIN
Mol. Mass.:
89534.43
Organism:
Hansenula anomala
Description:
ChEMBL_353428
Residue:
825
  
Inhibitor
Name:
BDBM50186736
Synonyms:
CHEMBL380311 | L-1,4-dideoxy-4,4-difluorogulonojirimycin
Type:
Small organic molecule
Emp. Form.:
C6H11F2NO3
Mol. Mass.:
183.1532
SMILES:
OC[C@@H]1NC[C@@H](O)[C@@H](O)C1(F)F
: