Target
Adenosine receptor A2b
Ligand
BDBM50186976
Substrate
Meas. Tech.
ChEMBL_376053 (CHEMBL864807)
IC50
12±n/a nM
Citation
 Esteve, CNueda, ADíaz, JLBeleta, JCárdenas, ALozoya, ECadavid, MILoza, MIRyder, HVidal, B New pyrrolopyrimidin-6-yl benzenesulfonamides: potent A2B adenosine receptor antagonists. Bioorg Med Chem Lett 16:3642-5 (2006)  
Target
Name:
Adenosine receptor A2b
Synonyms:
AA2BR_HUMAN ADORA2B Adenosine receptors A2b | Adenosine receptors; A2a & A2b
Type:
G Protein-Coupled Receptor (GPCR)
Mol. Mass.:
36341.22
Organism:
Homo sapiens (Human)
Description:
Residue:
332
  
Inhibitor
Name:
BDBM50186976
Synonyms:
4-(1,3-dimethyl-2,4-dioxo-2,3,4,5-tetrahydro-1H-pyrrolo[3,2-d]pyrimidin-6-yl)-N-(pyridin-2-yl)benzenesulfonamide | CHEMBL208705
Type:
Small organic molecule
Emp. Form.:
C19H17N5O4S
Mol. Mass.:
411.434
SMILES:
Cn1c2cc([nH]c2c(=O)n(C)c1=O)-c1ccc(cc1)S(=O)(=O)Nc1ccccn1
: