Target
Adenosine receptor A2b
Ligand
BDBM50186973
Substrate
Meas. Tech.
ChEMBL_376053 (CHEMBL864807)
IC50
4±n/a nM
Citation
 Esteve, CNueda, ADíaz, JLBeleta, JCárdenas, ALozoya, ECadavid, MILoza, MIRyder, HVidal, B New pyrrolopyrimidin-6-yl benzenesulfonamides: potent A2B adenosine receptor antagonists. Bioorg Med Chem Lett 16:3642-5 (2006)  
Target
Name:
Adenosine receptor A2b
Synonyms:
AA2BR_HUMAN ADORA2B Adenosine receptors A2b | Adenosine receptors; A2a & A2b
Type:
G Protein-Coupled Receptor (GPCR)
Mol. Mass.:
36341.22
Organism:
Homo sapiens (Human)
Description:
Residue:
332
  
Inhibitor
Name:
BDBM50186973
Synonyms:
6-(4-(4-((5-chlorothiophen-2-yl)methyl)piperazin-1-ylsulfonyl)phenyl)-1,3-dimethyl-1H-pyrrolo[3,2-d]pyrimidine-2,4(3H,5H)-dione | CHEMBL211813
Type:
Small organic molecule
Emp. Form.:
C23H24ClN5O4S2
Mol. Mass.:
534.051
SMILES:
Cn1c2cc([nH]c2c(=O)n(C)c1=O)-c1ccc(cc1)S(=O)(=O)N1CCN(Cc2ccc(Cl)s2)CC1
: