Target
Metabotropic glutamate receptor 5
Ligand
BDBM50187622
Substrate
Meas. Tech.
ChEMBL_361060 (CHEMBL859182)
EC50
43±n/a nM
Citation
 de Paulis, THemstapat, KChen, YZhang, YSaleh, SAlagille, DBaldwin, RMTamagnan, GDConn, PJ Substituent effects of N-(1,3-diphenyl-1H-pyrazol-5-yl)benzamides on positive allosteric modulation of the metabotropic glutamate-5 receptor in rat cortical astrocytes. J Med Chem 49:3332-44 (2006)  
Target
Name:
Metabotropic glutamate receptor 5
Synonyms:
GRM5_RAT Grm5 Mglur5 metabotropic glutamate 5/1-C metabotropic glutamate 5a
Type:
Enzyme
Mol. Mass.:
131900.14
Organism:
Rattus norvegicus (Rat)
Description:
P31424
Residue:
1203
  
Inhibitor
Name:
BDBM50187622
Synonyms:
(5-(4-cyanobenzoyl)imino-2-(4-cyanobenzoyl)-1,3-diphenyl-1,2-dihydropyrazole | CHEMBL207181
Type:
Small organic molecule
Emp. Form.:
C31H19N5O2
Mol. Mass.:
493.5149
SMILES:
O=C(\N=c1/cc(-c2ccccc2)n(C(=O)c2ccc(cc2)C#N)n1-c1ccccc1)c1ccc(cc1)C#N
: