Target
Metabotropic glutamate receptor 5
Ligand
BDBM50187629
Substrate
Meas. Tech.
ChEMBL_361060 (CHEMBL859182)
EC50
50±n/a nM
Citation
 de Paulis, THemstapat, KChen, YZhang, YSaleh, SAlagille, DBaldwin, RMTamagnan, GDConn, PJ Substituent effects of N-(1,3-diphenyl-1H-pyrazol-5-yl)benzamides on positive allosteric modulation of the metabotropic glutamate-5 receptor in rat cortical astrocytes. J Med Chem 49:3332-44 (2006)  
Target
Name:
Metabotropic glutamate receptor 5
Synonyms:
GRM5_RAT Grm5 Mglur5 metabotropic glutamate 5/1-C metabotropic glutamate 5a
Type:
Enzyme
Mol. Mass.:
131900.14
Organism:
Rattus norvegicus (Rat)
Description:
P31424
Residue:
1203
  
Inhibitor
Name:
BDBM50187629
Synonyms:
3-cyano-N-(1-(2-bromophenyl)-3-phenyl-1H-pyrazol-5-yl)-benzamide | CHEMBL208105
Type:
Small organic molecule
Emp. Form.:
C23H15BrN4O
Mol. Mass.:
443.295
SMILES:
Brc1ccccc1-n1nc(cc1NC(=O)c1cccc(c1)C#N)-c1ccccc1
: