Target
Vascular endothelial growth factor receptor 3
Ligand
BDBM50187996
Substrate
Meas. Tech.
ChEMBL_379521 (CHEMBL864252)
IC50
68±n/a nM
Citation
 Ji, ZAhmed, AAAlbert, DHBouska, JJBousquet, PFCunha, GAGlaser, KBGuo, JLi, JMarcotte, PAMoskey, MDPease, LJStewart, KDYates, MDavidsen, SKMichaelides, MR Isothiazolopyrimidines and isoxazolopyrimidines as novel multi-targeted inhibitors of receptor tyrosine kinases. Bioorg Med Chem Lett 16:4326-30 (2006)  
Target
Name:
Vascular endothelial growth factor receptor 3
Synonyms:
FLT-4 Fms-like tyrosine kinase 4 VEGFR-3 VGFR3_HUMAN Vascular endothelial growth factor receptor 3 (VEGFR-3) | Vascular endothelial growth factor receptor 3 (VEGFR3)
Type:
Protein
Mol. Mass.:
152749.58
Organism:
Homo sapiens (Human)
Description:
P35916-2
Residue:
1363
  
Inhibitor
Name:
BDBM50187996
Synonyms:
1-(4-(4-aminoisothiazolo[5,4-d]pyrimidin-3-yl)phenyl)-3-(2-fluoro-5-methylphenyl)urea | CHEMBL262433
Type:
Small organic molecule
Emp. Form.:
C19H15FN6OS
Mol. Mass.:
394.425
SMILES:
Cc1ccc(F)c(NC(=O)Nc2ccc(cc2)-c2nsc3ncnc(N)c23)c1
: