Target
Melanin-concentrating hormone receptor 1
Ligand
BDBM50188316
Substrate
Meas. Tech.
ChEMBL_390360 (CHEMBL869840)
Ki
3.1±n/a nM
Citation
 McBriar, MDGuzik, HShapiro, SXu, RParuchova, JClader, JWO'neill, KHawes, BSorota, SMargulis, MTucker, KWeston, DJCox, K Bicyclo[3.1.0]hexyl urea melanin concentrating hormone (MCH) receptor-1 antagonists: impacting hERG liability via aryl modifications. Bioorg Med Chem Lett 16:4262-5 (2006)  
Target
Name:
Melanin-concentrating hormone receptor 1
Synonyms:
G-protein coupled receptor 24 MCH receptor 1 MCH-R1 MCHR-1 MCHR1_HUMAN Melanin-Concentrating Hormone Receptor 1 (MCH1R) Melanin-concentrating hormone receptor 1 (MCH-1) Melanin-concentrating hormone receptor 1 (MCHR-1) SLC-1 Somatostatin receptor-like protein
Type:
G Protein-Coupled Receptor (GPCR)
Mol. Mass.:
45976.27
Organism:
Homo sapiens (Human)
Description:
Membranes from CHO-K1 cells stably expressing human MCH1R were used in assays.
Residue:
422
  
Inhibitor
Name:
BDBM50188316
Synonyms:
3-(3-chloro-4-fluorophenyl)-1-(3-(4-methylpiperazin-1-yl)propyl)-1-((1S,2R,5S)-5-(3-propionamidophenyl)bicyclo[3.1.0]hexan-2-yl)urea | CHEMBL215338
Type:
Small organic molecule
Emp. Form.:
C30H39ClFN5O2
Mol. Mass.:
556.114
SMILES:
CCC(=O)Nc1cccc(c1)[C@@]12C[C@@H]1[C@@H](CC2)N(CCCN1CCN(C)CC1)C(=O)Nc1ccc(F)c(Cl)c1
: