Target
Sodium- and chloride-dependent glycine transporter 1
Ligand
BDBM50188379
Substrate
Meas. Tech.
ChEMBL_378748 (CHEMBL871493)
EC50
474±n/a nM
Citation
 Alberati, DHainzl, DJolidon, SKrafft, EAKurt, AMaier, APinard, EThomas, AWZimmerli, D Discovery of 4-substituted-8-(2-hydroxy-2-phenyl-cyclohexyl)-2,8-diaza-spiro[4.5]decan-1-one as a novel class of highly selective GlyT1 inhibitors with improved metabolic stability. Bioorg Med Chem Lett 16:4311-5 (2006)  
Target
Name:
Sodium- and chloride-dependent glycine transporter 1
Synonyms:
GlyT-1 Glycine Transporters (GlyT1c) SC6A9_HUMAN Sodium- and chloride-dependent glycine transporter 1 Sodium- and chloride-dependent glycine transporter 1 (GlyT1c) Solute carrier family 6 member 9
Type:
Enzyme
Mol. Mass.:
78270.54
Organism:
Homo sapiens (Human)
Description:
P48067
Residue:
706
  
Inhibitor
Name:
BDBM50188379
Synonyms:
4-(4-fluorophenyl)-8-[2-(3-fluorophenyl)-2-hydroxycyclohexyl]-7-methyl-2,8-diazaspiro[4.5]decan-1-one | CHEMBL386805
Type:
Small organic molecule
Emp. Form.:
C27H32F2N2O2
Mol. Mass.:
454.552
SMILES:
CC1CC2(CCN1C1CCCCC1(O)c1cccc(F)c1)C(CNC2=O)c1ccc(F)cc1
: