Target
Epidermal growth factor receptor
Ligand
BDBM3535
Substrate
Meas. Tech.
ChEMBL_363124 (CHEMBL870841)
IC50
5±n/a nM
Citation
 Domarkas, JDudouit, FWilliams, CQiyu, QBanerjee, RBrahimi, FJean-Claude, BJ The combi-targeting concept: synthesis of stable nitrosoureas designed to inhibit the epidermal growth factor receptor (EGFR). J Med Chem 49:3544-52 (2006)  
Target
Name:
Epidermal growth factor receptor
Synonyms:
EGF Receptor Substrate EGFR_HUMAN ERBB1 Epidermal Growth Factor Receptor erbB-1 Epidermal growth factor receptor (EGFR) HER1 Proto-oncogene c-ErbB-1 Tyrosine-Protein Kinase ErbB-1
Type:
Receptor Kinase Domain
Mol. Mass.:
134279.59
Organism:
Homo sapiens (Human)
Description:
P00533
Residue:
1210
  
Inhibitor
Name:
BDBM3535
Synonyms:
4-N-(3-bromophenyl)-6-N-methylquinazoline-4,6-diamine CHEMBL50344 | PD153035 Analog 35
Type:
Small organic molecule
Emp. Form.:
C15H13BrN4
Mol. Mass.:
329.195
SMILES:
CNc1ccc2ncnc(Nc3cccc(Br)c3)c2c1
: