Target
Adenosine receptor A1
Ligand
BDBM21173
Substrate
Meas. Tech.
ChEMBL_364155 (CHEMBL870845)
Ki
0.9±n/a nM
Citation
 Kalla, RVElzein, EPerry, TLi, XPalle, VVarkhedkar, VGimbel, AMaa, TZeng, DZablocki, J Novel 1,3-disubstituted 8-(1-benzyl-1H-pyrazol-4-yl) xanthines: high affinity and selective A2B adenosine receptor antagonists. J Med Chem 49:3682-92 (2006)  
Target
Name:
Adenosine receptor A1
Synonyms:
A1 adenosine receptor (hA1) AA1R_HUMAN ADORA1 Adenosine A1-receptor Adenosine receptor A1 (hA1) | Adenosine transporter (AdT)
Type:
G Protein-Coupled Receptor (GPCR)
Mol. Mass.:
36520.92
Organism:
Homo sapiens (Human)
Description:
P30542
Residue:
326
  
Inhibitor
Name:
BDBM21173
Synonyms:
1,3-dipropyl-8-cyclopentylxanthine CHEMBL183 PD116948 | [3H]DPCPX
Type:
radiolabeled ligand
Emp. Form.:
C16H24N4O2
Mol. Mass.:
304.3874
SMILES:
CCCn1c2nc([nH]c2c(=O)n(CCC)c1=O)C1CCCC1
: