Target
Adenosine receptor A2b
Ligand
BDBM50233081
Substrate
Meas. Tech.
ChEMBL_364154 (CHEMBL870844)
Ki
11±n/a nM
Citation
 Kalla, RVElzein, EPerry, TLi, XPalle, VVarkhedkar, VGimbel, AMaa, TZeng, DZablocki, J Novel 1,3-disubstituted 8-(1-benzyl-1H-pyrazol-4-yl) xanthines: high affinity and selective A2B adenosine receptor antagonists. J Med Chem 49:3682-92 (2006)  
Target
Name:
Adenosine receptor A2b
Synonyms:
AA2BR_HUMAN ADORA2B Adenosine receptors A2b | Adenosine receptors; A2a & A2b
Type:
G Protein-Coupled Receptor (GPCR)
Mol. Mass.:
36341.22
Organism:
Homo sapiens (Human)
Description:
Residue:
332
  
Inhibitor
Name:
BDBM50233081
Synonyms:
8-(1-benzyl-1H-pyrazol-4-yl)-1,3-dipropyl-1H-purine-2,6(3H,7H)-dione CHEMBL254725
Type:
Small organic molecule
Emp. Form.:
C21H24N6O2
Mol. Mass.:
392.4543
SMILES:
CCCn1c2nc([nH]c2c(=O)n(CCC)c1=O)-c1cnn(Cc2ccccc2)c1
: