Target
Adenosine receptor A3
Ligand
BDBM50001493
Substrate
Meas. Tech.
ChEMBL_364157 (CHEMBL870209)
Ki
92600±n/a nM
Citation
 Kalla, RVElzein, EPerry, TLi, XPalle, VVarkhedkar, VGimbel, AMaa, TZeng, DZablocki, J Novel 1,3-disubstituted 8-(1-benzyl-1H-pyrazol-4-yl) xanthines: high affinity and selective A2B adenosine receptor antagonists. J Med Chem 49:3682-92 (2006)  
Target
Name:
Adenosine receptor A3
Synonyms:
A3 adenosine receptor (hA3) ADORA3 | Adenosine A3 receptor (A3AR)
Type:
G Protein-Coupled Receptor (GPCR)
Mol. Mass.:
36197.32
Organism:
Homo sapiens (Human)
Description:
P0DMS8
Residue:
318
  
Inhibitor
Name:
BDBM50001493
Synonyms:
3-Propyl-3,7-dihydro-purine-2,6-dione 3-Propylxanthine (enprofylline) ENPROFYLLINE
Type:
Small organic molecule
Emp. Form.:
C8H10N4O2
Mol. Mass.:
194.1906
SMILES:
CCCn1c2nc[nH]c2c(=O)[nH]c1=O
: