Target
Adenosine receptor A2b
Ligand
BDBM50188578
Substrate
Meas. Tech.
ChEMBL_364154 (CHEMBL870844)
Ki
1±n/a nM
Citation
 Kalla, RVElzein, EPerry, TLi, XPalle, VVarkhedkar, VGimbel, AMaa, TZeng, DZablocki, J Novel 1,3-disubstituted 8-(1-benzyl-1H-pyrazol-4-yl) xanthines: high affinity and selective A2B adenosine receptor antagonists. J Med Chem 49:3682-92 (2006)  
Target
Name:
Adenosine receptor A2b
Synonyms:
AA2BR_HUMAN ADORA2B Adenosine receptors A2b | Adenosine receptors; A2a & A2b
Type:
G Protein-Coupled Receptor (GPCR)
Mol. Mass.:
36341.22
Organism:
Homo sapiens (Human)
Description:
Residue:
332
  
Inhibitor
Name:
BDBM50188578
Synonyms:
8-(1-(3-(trifluoromethyl)benzyl)-1H-pyrazol-4-yl)-1,3-dimethyl-1H-purine-2,6(3H,7H)-dione | CHEMBL208824
Type:
Small organic molecule
Emp. Form.:
C18H15F3N6O2
Mol. Mass.:
404.3459
SMILES:
Cn1c2nc([nH]c2c(=O)n(C)c1=O)-c1cnn(Cc2cccc(c2)C(F)(F)F)c1
: