Target
Adenosine receptor A1
Ligand
BDBM50229886
Substrate
Meas. Tech.
ChEMBL_364155 (CHEMBL870845)
Ki
>1000±n/a nM
Citation
 Kalla, RVElzein, EPerry, TLi, XPalle, VVarkhedkar, VGimbel, AMaa, TZeng, DZablocki, J Novel 1,3-disubstituted 8-(1-benzyl-1H-pyrazol-4-yl) xanthines: high affinity and selective A2B adenosine receptor antagonists. J Med Chem 49:3682-92 (2006)  
Target
Name:
Adenosine receptor A1
Synonyms:
A1 adenosine receptor (hA1) AA1R_HUMAN ADORA1 Adenosine A1-receptor Adenosine receptor A1 (hA1) | Adenosine transporter (AdT)
Type:
G Protein-Coupled Receptor (GPCR)
Mol. Mass.:
36520.92
Organism:
Homo sapiens (Human)
Description:
P30542
Residue:
326
  
Inhibitor
Name:
BDBM50229886
Synonyms:
2-(3,4-Dimethoxy-phenyl)-N-[5-(2,6-dioxo-1,3-dipropyl-2,3,6,7-tetrahydro-1H-purin-8-yl)-1-methyl-1H-pyrazol-3-yl]-acetamide CHEMBL408186
Type:
Small organic molecule
Emp. Form.:
C25H31N7O5
Mol. Mass.:
509.5575
SMILES:
CCCn1c2nc([nH]c2c(=O)n(CCC)c1=O)-c1cc(NC(=O)Cc2ccc(OC)c(OC)c2)nn1C
: