Target
RAC-gamma serine/threonine-protein kinase
Ligand
BDBM50188938
Substrate
Meas. Tech.
ChEMBL_389599 (CHEMBL868042)
IC50
>25000±n/a nM
Citation
 Lin, XMurray, JMRico, ACWang, MXChu, DTZhou, YDel Rosario, MKaufman, SMa, SFang, ECrawford, KJefferson, AB Discovery of 2-pyrimidyl-5-amidothiophenes as potent inhibitors for AKT: synthesis and SAR studies. Bioorg Med Chem Lett 16:4163-8 (2006)  
Target
Name:
RAC-gamma serine/threonine-protein kinase
Synonyms:
AKT3 PKB gamma Protein kinase Akt-3 Protein kinase B, gamma RAC-gamma serine/threonine-protein kinase Serine/threonine-protein kinase AKT | Serine/threonine-protein kinase AKT3
Type:
Enzyme
Mol. Mass.:
55769.36
Organism:
Homo sapiens (Human)
Description:
Residue:
479
  
Inhibitor
Name:
BDBM50188938
Synonyms:
CHEMBL214070 | N-(2,4-dichlorophenethyl)-5-(2-(propylamino)pyrimidin-4-yl)thiophene-2-carboxamide
Type:
Small organic molecule
Emp. Form.:
C20H20Cl2N4OS
Mol. Mass.:
435.37
SMILES:
CCCNc1nccc(n1)-c1ccc(s1)C(=O)NCCc1ccc(Cl)cc1Cl
: