Target
Glutamate receptor ionotropic, NMDA 2B
Ligand
BDBM50241127
Substrate
Meas. Tech.
ChEMBL_395467 (CHEMBL909221)
IC50
5±n/a nM
Citation
 Borza, IKolok, SGere, ANagy, JFodor, LGalgóczy, KFetter, JBertha, FAgai, BHorváth, CFarkas, SDomány, G Benzimidazole-2-carboxamides as novel NR2B selective NMDA receptor antagonists. Bioorg Med Chem Lett 16:4638-40 (2006)  
Target
Name:
Glutamate receptor ionotropic, NMDA 2B
Synonyms:
GluN2B Grin2b NMDA receptor subunit N2B (GluN2B) NMDE2_RAT | NR2B
Type:
Protein
Mol. Mass.:
166077.66
Organism:
Rattus norvegicus (Rat)
Description:
Q00960
Residue:
1482
  
Inhibitor
Name:
BDBM50241127
Synonyms:
(5-hydroxy-1H-benzoimidazol-2-yl)-[4-(3-methyl-benzyl)-piperidin-1-yl]-methanone | CHEMBL220266
Type:
Small organic molecule
Emp. Form.:
C21H23N3O2
Mol. Mass.:
349.4262
SMILES:
Cc1cccc(CC2CCN(CC2)C(=O)c2nc3ccc(O)cc3[nH]2)c1
: