Target
Fatty acid synthase
Ligand
BDBM50189488
Substrate
Meas. Tech.
ChEMBL_404787 (CHEMBL869274)
IC50
194±n/a nM
Citation
 Rivkin, AKim, YRGoulet, MTBays, NHill, ADKariv, IKrauss, SGinanni, NStrack, PRKohl, NEChung, CCVarnerin, JPGoudreau, PNChang, ATota, MRMunoz, B 3-Aryl-4-hydroxyquinolin-2(1H)-one derivatives as type I fatty acid synthase inhibitors. Bioorg Med Chem Lett 16:4620-3 (2006)  
Target
Name:
Fatty acid synthase
Synonyms:
FAS FAS_HUMAN HU FASN
Type:
Enzyme
Mol. Mass.:
273419.37
Organism:
Homo sapiens (Human)
Description:
P49327
Residue:
2511
  
Inhibitor
Name:
BDBM50189488
Synonyms:
7-chloro-4-hydroxy-2-oxo-3-(3-(pyridin-3-yl)phenyl)-1,2-dihydroquinoline-6-carbonitrile | CHEMBL376206
Type:
Small organic molecule
Emp. Form.:
C21H12ClN3O2
Mol. Mass.:
373.792
SMILES:
Oc1c(-c2cccc(c2)-c2cccnc2)c(=O)[nH]c2cc(Cl)c(cc12)C#N
: