Target
Fatty acid synthase
Ligand
BDBM50189463
Substrate
Meas. Tech.
ChEMBL_404787 (CHEMBL869274)
IC50
734±n/a nM
Citation
 Rivkin, AKim, YRGoulet, MTBays, NHill, ADKariv, IKrauss, SGinanni, NStrack, PRKohl, NEChung, CCVarnerin, JPGoudreau, PNChang, ATota, MRMunoz, B 3-Aryl-4-hydroxyquinolin-2(1H)-one derivatives as type I fatty acid synthase inhibitors. Bioorg Med Chem Lett 16:4620-3 (2006)  
Target
Name:
Fatty acid synthase
Synonyms:
FAS FAS_HUMAN HU FASN
Type:
Enzyme
Mol. Mass.:
273419.37
Organism:
Homo sapiens (Human)
Description:
P49327
Residue:
2511
  
Inhibitor
Name:
BDBM50189463
Synonyms:
7-chloro-4-hydroxy-3-(3-(1-methyl-1H-pyrazol-4-yl)phenyl)-2-oxo-1,2-dihydroquinoline-6-carbonitrile | CHEMBL213635
Type:
Small organic molecule
Emp. Form.:
C20H13ClN4O2
Mol. Mass.:
376.796
SMILES:
Cn1cc(cn1)-c1cccc(c1)-c1c(O)c2cc(C#N)c(Cl)cc2[nH]c1=O
: