Target
Fatty acid synthase
Ligand
BDBM50189477
Substrate
Meas. Tech.
ChEMBL_404788 (CHEMBL869275)
IC50
3000±n/a nM
Citation
 Rivkin, AKim, YRGoulet, MTBays, NHill, ADKariv, IKrauss, SGinanni, NStrack, PRKohl, NEChung, CCVarnerin, JPGoudreau, PNChang, ATota, MRMunoz, B 3-Aryl-4-hydroxyquinolin-2(1H)-one derivatives as type I fatty acid synthase inhibitors. Bioorg Med Chem Lett 16:4620-3 (2006)  
Target
Name:
Fatty acid synthase
Synonyms:
FAS_RAT | Fasn
Type:
PROTEIN
Mol. Mass.:
272640.19
Organism:
Rattus norvegicus
Description:
ChEMBL_940338
Residue:
2505
  
Inhibitor
Name:
BDBM50189477
Synonyms:
4-hydroxy-8-nitro-3-phenylquinolin-2(1H)-one | CHEMBL377646
Type:
Small organic molecule
Emp. Form.:
C15H10N2O4
Mol. Mass.:
282.2509
SMILES:
Oc1c(-c2ccccc2)c(=O)[nH]c2c(cccc12)[N+]([O-])=O
: