Target
Angiotensin-converting enzyme
Ligand
BDBM50189521
Substrate
Meas. Tech.
ChEMBL_405833 (CHEMBL869865)
Ki
43000±n/a nM
Citation
 Nchinda, ATChibale, KRedelinghuys, PSturrock, ED Synthesis of novel keto-ACE analogues as domain-selective angiotensin I-converting enzyme inhibitors. Bioorg Med Chem Lett 16:4612-5 (2006)  
Target
Name:
Angiotensin-converting enzyme
Synonyms:
ACE Angiotensin converting enzyme (ACE) Angiotensin-converting enzyme, soluble form CD_antigen=CD143 DCP1 Kininase II
Type:
Enzyme
Mol. Mass.:
149709.01
Organism:
Homo sapiens (Human)
Description:
Residue:
1306
  
Inhibitor
Name:
BDBM50189521
Synonyms:
(S)-2-((S)-5-(tert-butoxycarbonyl)-4-oxo-6-phenylhexanamido)-3-phenylpropanoic acid | CHEMBL212864
Type:
Small organic molecule
Emp. Form.:
C26H32N2O6
Mol. Mass.:
468.5421
SMILES:
CC(C)(C)OC(=O)N[C@@H](Cc1ccccc1)C(=O)CCC(=O)N[C@@H](Cc1ccccc1)C(O)=O
: