Target
Sodium-dependent noradrenaline transporter
Ligand
BDBM50189572
Substrate
Meas. Tech.
ChEMBL_395400 (CHEMBL908065)
Ki
2.94±n/a nM
Citation
 Zeng, FJarkas, NOwens, MJKilts, CDNemeroff, CBGoodman, MM Synthesis and monoamine transporter affinity of front bridged tricyclic 3beta-(4'-halo or 4'-methyl)phenyltropanes bearing methylene or carbomethoxymethylene on the bridge to the 2beta-position. Bioorg Med Chem Lett 16:4661-3 (2006)  
Target
Name:
Sodium-dependent noradrenaline transporter
Synonyms:
Monoamine transporter NET Noradrenaline Transporter (NET) Norepinephrine transporter protein (NET) SLC6A2 Sodium-dependent noradrenaline transporter (NET) | Solute carrier family 6 member 2
Type:
Multi-pass membrane protein
Mol. Mass.:
69337.72
Organism:
Homo sapiens (Human)
Description:
P23975
Residue:
617
  
Inhibitor
Name:
BDBM50189572
Synonyms:
3-(4-bromo-phenyl)-5-methylene-7-aza-tricyclo[5.3.0.0*4,8*]decane | CHEMBL212452
Type:
Small organic molecule
Emp. Form.:
C16H18BrN
Mol. Mass.:
304.225
SMILES:
Brc1ccc(cc1)C1CC2CCC3C1C(=C)CN23
: