Target
Lutropin-choriogonadotropic hormone receptor
Ligand
BDBM50189776
Substrate
Meas. Tech.
ChEMBL_367601 (CHEMBL864095)
EC50
1100±n/a nM
Citation
 Moore, SJaeschke, HKleinau, GNeumann, SCostanzi, SJiang, JKChildress, JRaaka, BMColson, APaschke, RKrause, GThomas, CJGershengorn, MC Evaluation of small-molecule modulators of the luteinizing hormone/choriogonadotropin and thyroid stimulating hormone receptors: structure-activity relationships and selective binding patterns. J Med Chem 49:3888-96 (2006)  
Target
Name:
Lutropin-choriogonadotropic hormone receptor
Synonyms:
LCGR LH/CG-R LHR LSH-R Luteinizing hormone receptor
Type:
PROTEIN
Mol. Mass.:
78662.77
Organism:
Homo sapiens (Human)
Description:
ChEMBL_562598
Residue:
699
  
Inhibitor
Name:
BDBM50189776
Synonyms:
CHEMBL211871 | tert-butyl 5-amino-4-(3-methoxyphenyl)-2-(methylthio)thieno[2,3-d]pyrimidine-6-carboxylate
Type:
Small organic molecule
Emp. Form.:
C19H21N3O3S2
Mol. Mass.:
403.518
SMILES:
COc1cccc(c1)-c1nc(SC)nc2sc(C(=O)OC(C)(C)C)c(N)c12
: