Target
Peroxisome proliferator-activated receptor delta
Ligand
BDBM50085041
Substrate
Meas. Tech.
ChEMBL_393995 (CHEMBL854664)
EC50
125±n/a nM
Citation
 Basséne, CESuzenet, FHennuyer, NStaels, BCaignard, DHDacquet, CRenard, PGuillaumet, G Studies towards the conception of new selective PPARbeta/delta ligands. Bioorg Med Chem Lett 16:4528-32 (2006)  
Target
Name:
Peroxisome proliferator-activated receptor delta
Synonyms:
NR1C2 NUCI Nuclear receptor subfamily 1 group C member 2 PPAR-beta PPARD Peroxisome proliferator-activated receptor Peroxisome proliferator-activated receptor delta
Type:
Enzyme
Mol. Mass.:
49910.45
Organism:
Homo sapiens (Human)
Description:
Q03181
Residue:
441
  
Inhibitor
Name:
BDBM50085041
Synonyms:
2-(4-(3-(4-acetyl-3-hydroxy-2-propylphenoxy)propoxy)phenoxy)acetic acid L-165041 {4-[3-(4-Acetyl-3-hydroxy-2-propyl-phenoxy)-propoxy]-phenoxy}-acetic acid(L-165041) | {4-[3-(4-acetyl-3-hydroxy-2-propylphenoxy)propoxy]phenoxy}acetic acid
Type:
Small organic molecule
Emp. Form.:
C22H26O7
Mol. Mass.:
402.4376
SMILES:
CCCc1c(O)c(ccc1OCCCOc1ccc(OCC(O)=O)cc1)C(C)=O
: