Target
Cytochrome P450 2C9
Ligand
BDBM50189987
Substrate
Meas. Tech.
ChEMBL_391265 (CHEMBL870461)
IC50
>18000±n/a nM
Citation
 Westaway, SMChung, YKDavis, JBHolland, VJerman, JCMedhurst, SJRami, HKStemp, GStevens, AJThompson, MWinborn, KYWright, J N-Tetrahydroquinolinyl, N-quinolinyl and N-isoquinolinyl biaryl carboxamides as antagonists of TRPV1. Bioorg Med Chem Lett 16:4533-6 (2006)  
Target
Name:
Cytochrome P450 2C9
Synonyms:
(R)-limonene 6-monooxygenase CP2C9_HUMAN CYP2C9 Cytochrome P450 2C9 (CYP2C9 ) P-450MP P450 PB-1 | S-mephenytoin 4-hydroxylase
Type:
Enzyme
Mol. Mass.:
55636.33
Organism:
Homo sapiens (Human)
Description:
P11712
Residue:
490
  
Inhibitor
Name:
BDBM50189987
Synonyms:
6-phenyl-N-(quinolin-7-yl)nicotinamide N-quinolin-7-yl-6-phenylnicotinamide
Type:
Small organic molecule
Emp. Form.:
C21H15N3O
Mol. Mass.:
325.3633
SMILES:
O=C(Nc1ccc2cccnc2c1)c1ccc(nc1)-c1ccccc1
: