Target
D(2) dopamine receptor
Ligand
BDBM50190078
Substrate
Meas. Tech.
ChEMBL_393314 (CHEMBL911524)
Ki
177±n/a nM
Citation
 Su, JTang, HMcKittrick, BABurnett, DAZhang, HSmith-Torhan, AFawzi, ALachowicz, J Modification of the clozapine structure by parallel synthesis. Bioorg Med Chem Lett 16:4548-53 (2006)  
Target
Name:
D(2) dopamine receptor
Synonyms:
D(2) dopamine receptor DOPAMINE D2 Long DRD2 Dopamine D2 receptor Dopamine D2 receptor (D2R) Dopamine2-like | d2
Type:
Cell-surface receptors
Mol. Mass.:
50647.10
Organism:
Homo sapiens (Human)
Description:
P14416
Residue:
443
  
Inhibitor
Name:
BDBM50190078
Synonyms:
8-chloro-11-[4-(2,4-difluoro-benzyl)-piperazin-1-yl]-5H-dibenzo[b,e][1,4]diazepine | CHEMBL213200
Type:
Small organic molecule
Emp. Form.:
C24H21ClF2N4
Mol. Mass.:
438.9
SMILES:
Fc1ccc(CN2CCN(CC2)C2=Nc3cc(Cl)ccc3Nc3ccccc23)c(F)c1
: