Target
D(2) dopamine receptor
Ligand
BDBM50190214
Substrate
Meas. Tech.
ChEMBL_391332 (CHEMBL870468)
Ki
181±n/a nM
Citation
 Sasikumar, TKBurnett, DAZhang, HSmith-Torhan, AFawzi, ALachowicz, JE Hydrazides of clozapine: a new class of D1 dopamine receptor subtype selective antagonists. Bioorg Med Chem Lett 16:4543-7 (2006)  
Target
Name:
D(2) dopamine receptor
Synonyms:
D(2) dopamine receptor DOPAMINE D2 Long DRD2 Dopamine D2 receptor Dopamine D2 receptor (D2R) Dopamine2-like | d2
Type:
Cell-surface receptors
Mol. Mass.:
50647.10
Organism:
Homo sapiens (Human)
Description:
P14416
Residue:
443
  
Inhibitor
Name:
BDBM50190214
Synonyms:
3-chloro-N-[8-chloro-11-(4-methyl-piperazin-1-yl)-dibenzo[b,e][1,4]diazepin-5-yl]-benzamide | CHEMBL213084
Type:
Small organic molecule
Emp. Form.:
C25H23Cl2N5O
Mol. Mass.:
480.389
SMILES:
CN1CCN(CC1)C1=Nc2cc(Cl)ccc2N(NC(=O)c2cccc(Cl)c2)c2ccccc12
: