Target
Metabotropic glutamate receptor 2
Ligand
BDBM50177053
Substrate
Meas. Tech.
ChEMBL_406098 (CHEMBL913251)
IC50
>10000±n/a nM
Citation
 Zheng, GZBhatia, PKolasa, TPatel, MEl Kouhen, OFChang, RUchic, MEMiller, LBaker, SLehto, SGHonore, PWetter, JMMarsh, KCMoreland, RBBrioni, JDStewart, AO Correlation between brain/plasma ratios and efficacy in neuropathic pain models of selective metabotropic glutamate receptor 1 antagonists. Bioorg Med Chem Lett 16:4936-40 (2006)  
Target
Name:
Metabotropic glutamate receptor 2
Synonyms:
GPRC1B GRM2_HUMAN Metabotropic glutamate receptor mGlu2 | metabotropic glutamate 2
Type:
Enzyme
Mol. Mass.:
95584.88
Organism:
Homo sapiens (Human)
Description:
Q14416
Residue:
872
  
Inhibitor
Name:
BDBM50177053
Synonyms:
9-Dimethylamino-3-(4-ethyl-phenyl)-3H-pyrido[3',2':4,5]thieno[3,2-d]pyrimidin-4-one CHEMBL385336
Type:
Small organic molecule
Emp. Form.:
C19H18N4OS
Mol. Mass.:
350.437
SMILES:
CCc1ccc(cc1)-n1cnc2c(sc3nccc(N(C)C)c23)c1=O
: