Target
Amiloride-sensitive sodium channel subunit alpha
Ligand
BDBM50190458
Substrate
Meas. Tech.
ChEMBL_375179 (CHEMBL868533)
IC50
21±n/a nM
Citation
 Hirsh, AJMolino, BFZhang, JAstakhova, NGeiss, WBSargent, BJSwenson, BDUsyatinsky, AWyle, MJBoucher, RCSmith, RTZamurs, AJohnson, MR Design, synthesis, and structure-activity relationships of novel 2-substituted pyrazinoylguanidine epithelial sodium channel blockers: drugs for cystic fibrosis and chronic bronchitis. J Med Chem 49:4098-115 (2006)  
Target
Name:
Amiloride-sensitive sodium channel subunit alpha
Synonyms:
Alpha-ENaC Amiloride-sensitive sodium channel alpha-subunit Epithelial Na(+) channel subunit alpha SCNEA SCNN1A | SCNNA_HUMAN
Type:
PROTEIN
Mol. Mass.:
75711.44
Organism:
Homo sapiens (Human)
Description:
ChEMBL_375179
Residue:
669
  
Inhibitor
Name:
BDBM50190458
Synonyms:
CHEMBL386222 | sulfuric acid mono-(4-{4-[N-(3,5-diamino-6-chloropyrazine-2-carbonyl)guanidine]butyl}phenyl)ester
Type:
Small organic molecule
Emp. Form.:
C16H20ClN7O4S
Mol. Mass.:
441.893
SMILES:
NC(NC(=O)c1nc(Cl)c(N)nc1N)=NCCCCc1ccc(cc1)S(O)(=O)=O
: