Target
Solute carrier family 15 member 1
Ligand
BDBM50169169
Substrate
Meas. Tech.
ChEMBL_370530 (CHEMBL871421)
Ki
100000±n/a nM
Citation
 Biegel, AGebauer, SBrandsch, MNeubert, KThondorf, I Structural requirements for the substrates of the H+/peptide cotransporter PEPT2 determined by three-dimensional quantitative structure-activity relationship analysis. J Med Chem 49:4286-96 (2006)  
Target
Name:
Solute carrier family 15 member 1
Synonyms:
Intestinal H(+)/peptide cotransporter Oligopeptide transporter, small intestine isoform Peptide transporter 1 SLC15A1
Type:
PROTEIN
Mol. Mass.:
78818.07
Organism:
Homo sapiens (Human)
Description:
ChEMBL_1488839
Residue:
708
  
Inhibitor
Name:
BDBM50169169
Synonyms:
(2S)-2-[(2S)-2-[(2S)-2-amino-4-methylpentanamido]propanamido]-5-[(diaminomethylidene)amino]pentanoic acid CHEMBL190897
Type:
Small organic molecule
Emp. Form.:
C15H30N6O4
Mol. Mass.:
358.4365
SMILES:
CC(C)C[C@H](N)C(=O)N[C@@H](C)C(=O)N[C@@H](CCCNC(N)=N)C(O)=O
: