Target
Adenosine receptor A1
Ligand
BDBM50190705
Substrate
Meas. Tech.
ChEMBL_369241 (CHEMBL864795)
Ki
100±n/a nM
Citation
 Yan, LBertarelli, DCHayallah, AMMeyer, HKlotz, KNMüller, CE A new synthesis of sulfonamides by aminolysis of p-nitrophenylsulfonates yielding potent and selective adenosine A2B receptor antagonists. J Med Chem 49:4384-91 (2006)  
Target
Name:
Adenosine receptor A1
Synonyms:
AA1R_RAT ADENOSINE A1 high Adenosine A1 receptor (A1) Adenosine receptors A1 | Adora1
Type:
Protein
Mol. Mass.:
36704.13
Organism:
Rattus norvegicus (rat)
Description:
Residue:
326
  
Inhibitor
Name:
BDBM50190705
Synonyms:
4-(1-propylxanthin-8-yl)phenylsulfonamidoacetic acid | CHEMBL212217
Type:
Small organic molecule
Emp. Form.:
C16H17N5O6S
Mol. Mass.:
407.401
SMILES:
CCCn1c(=O)[nH]c2nc([nH]c2c1=O)-c1ccc(cc1)S(=O)(=O)NCC(O)=O
: