Target
Adenosine receptor A1
Ligand
BDBM50190704
Substrate
Meas. Tech.
ChEMBL_369241 (CHEMBL864795)
Ki
45±n/a nM
Citation
 Yan, LBertarelli, DCHayallah, AMMeyer, HKlotz, KNMüller, CE A new synthesis of sulfonamides by aminolysis of p-nitrophenylsulfonates yielding potent and selective adenosine A2B receptor antagonists. J Med Chem 49:4384-91 (2006)  
Target
Name:
Adenosine receptor A1
Synonyms:
AA1R_RAT ADENOSINE A1 high Adenosine A1 receptor (A1) Adenosine receptors A1 | Adora1
Type:
Protein
Mol. Mass.:
36704.13
Organism:
Rattus norvegicus (rat)
Description:
Residue:
326
  
Inhibitor
Name:
BDBM50190704
Synonyms:
8-[4-(2-Hydroxyethylamidosulfonyl)phenyl]-1-propylxanthine | CHEMBL378102
Type:
Small organic molecule
Emp. Form.:
C16H19N5O5S
Mol. Mass.:
393.418
SMILES:
CCCn1c(=O)[nH]c2nc([nH]c2c1=O)-c1ccc(cc1)S(=O)(=O)NCCO
: