Target
Acetylcholinesterase
Ligand
BDBM50190759
Substrate
Meas. Tech.
ChEMBL_369156 (CHEMBL862883)
IC50
>3000±n/a nM
Citation
 Pryde, DCMaw, GNPlanken, SPlatts, MYSanderson, VCorless, MStobie, ABarber, CGRussell, RFoster, LBarker, LWayman, CVan Der Graaf, PStacey, PMorren, DKohl, CBeaumont, KCoggon, STute, M Novel selective inhibitors of neutral endopeptidase for the treatment of female sexual arousal disorder. Synthesis and activity of functionalized glutaramides. J Med Chem 49:4409-24 (2006)  
Target
Name:
Acetylcholinesterase
Synonyms:
ACES_HUMAN Acetylcholinesterase (AChE) | Acetylcholinesterase (human AChE)
Type:
Enzyme
Mol. Mass.:
67792.70
Organism:
Homo sapiens (Human)
Description:
P22303
Residue:
614
  
Inhibitor
Name:
BDBM50190759
Synonyms:
2-((1-(((R)-1-benzylpyrrolidin-3-yl)carbamoyl)cyclopentyl)methyl)pentanoic acid | CHEMBL377041
Type:
Small organic molecule
Emp. Form.:
C23H34N2O3
Mol. Mass.:
386.5277
SMILES:
CCCC(CC1(CCCC1)C(=O)N[C@@H]1CCN(Cc2ccccc2)C1)C(O)=O
: