Target
Prostacyclin receptor
Ligand
BDBM50191132
Substrate
Meas. Tech.
ChEMBL_400373 (CHEMBL912671)
IC50
58±n/a nM
Citation
 Tanaka, AHattori, KTaniguchi, KOkitsu, OTabuchi, SNishio, MNagakura, YMaeda, NMurai, HSeki, J Replacing the cyclohexene-linker of FR181157 leading to novel IP receptor agonists: orally active prostacyclin mimetics. Part 6. Bioorg Med Chem Lett 16:4861-4 (2006)  
Target
Name:
Prostacyclin receptor
Synonyms:
PGI receptor PRIPR Prostacyclin (IP) Receptor Prostaglandin I Prostaglandin I2 receptor | Prostanoid IP receptor
Type:
G Protein-Coupled Receptor (GPCR)
Mol. Mass.:
40968.22
Organism:
Homo sapiens (Human)
Description:
The membranes prepared from human platelet were used in binding assay.
Residue:
386
  
Inhibitor
Name:
BDBM50191132
Synonyms:
CHEMBL438092 | sodium (S)-2-(3-((2-(4,5-diphenyloxazol-2-yl)pyrrolidin-1-yl)methyl)phenoxy)acetate
Type:
Small organic molecule
Emp. Form.:
C28H25N2O4
Mol. Mass.:
453.5096
SMILES:
[O-]C(=O)COc1cccc(CN2CCC[C@H]2c2nc(c(o2)-c2ccccc2)-c2ccccc2)c1
: