Target
Dipeptidyl peptidase 4
Ligand
BDBM50191170
Substrate
Meas. Tech.
ChEMBL_397956 (CHEMBL856332)
IC50
>100000±n/a nM
Citation
 Soroka, AVan der Veken, PDe Meester, ILambeir, AMMaes, MBScharpé, SHaemers, AAugustyns, K Synthesis and dipeptidyl peptidase inhibition of N-(4-substituted-2,4-diaminobutanoyl)piperidines. Bioorg Med Chem Lett 16:4777-9 (2006)  
Target
Name:
Dipeptidyl peptidase 4
Synonyms:
ADABP Adenosine deaminase complexing protein 2 CD_antigen=CD26 DPP4 DPPIV Dipeptidyl peptidase 4 (DPP IV) Dipeptidyl peptidase 4 (DPP4) Dipeptidyl peptidase 4 membrane form Dipeptidyl peptidase IV Dipeptidyl peptidase IV (DDP-IV) Dipeptidyl peptidase IV membrane form Dipeptidyl peptidase-IV (DPP-4) T-cell activation antigen CD26 | TP103
Type:
Enzyme
Mol. Mass.:
88271.01
Organism:
Homo sapiens (Human)
Description:
P27487
Residue:
766
  
Inhibitor
Name:
BDBM50191170
Synonyms:
(2S,4S)-4-(4-chlorobenzylamino)-2-amino-1-(piperidin-1-yl)hexan-1-one | CHEMBL215244
Type:
Small organic molecule
Emp. Form.:
C18H28ClN3O
Mol. Mass.:
337.887
SMILES:
CC[C@@H](C[C@H](N)C(=O)N1CCCCC1)NCc1ccc(Cl)cc1
: