Target
Melanocyte-stimulating hormone receptor
Ligand
BDBM50191569
Substrate
Meas. Tech.
ChEMBL_376971 (CHEMBL853374)
Ki
1.3±n/a nM
Citation
 Tian, XField, TBSwitzer, AGMazur, AWEbetino, FHWos, JABerberich, SMJayasinghe, LRObringer, CMDowty, MEPinney, BBFarmer, JACrossdoersen, DSheldon, RJ Design, synthesis, and evaluation of proline and pyrrolidine based melanocortin receptor agonists. A conformationally restricted dipeptide mimic approach. J Med Chem 49:4745-61 (2006)  
Target
Name:
Melanocyte-stimulating hormone receptor
Synonyms:
MC1-R MSH-R MSHR_HUMAN Melanocortin receptor (M1 and M4) Melanocortin receptor 1 (MC1-R) | Melanocortin receptor 1 (MC1R)
Type:
Enzyme
Mol. Mass.:
34717.23
Organism:
Homo sapiens (Human)
Description:
Q01726
Residue:
317
  
Inhibitor
Name:
BDBM50191569
Synonyms:
(S)-2-Acetamido-N-((R)-1-((2S,4S)-2-(3-guanidinopropyl)-4-(naphthalen-2-ylmethoxy)pyrrolidin-1-yl)-1-oxo-3-phenylpropan-2-yl)-3-(1H-imidazol-4-yl)propanamide | CHEMBL377465
Type:
Small organic molecule
Emp. Form.:
C36H44N8O4
Mol. Mass.:
652.7858
SMILES:
CC(=O)N[C@@H](Cc1cnc[nH]1)C(=O)N[C@H](Cc1ccccc1)C(=O)N1C[C@H](C[C@@H]1CCCN=C(N)N)OCc1ccc2ccccc2c1
: