Target
Glutamate receptor 2
Ligand
BDBM50191956
Substrate
Meas. Tech.
ChEMBL_393593 (CHEMBL856924)
EC50
984±n/a nM
Citation
 Zarrinmayeh, HTromiczak, EZimmerman, DMRankl, NHo, KHDominguez, ECastaño, AEscribano, AFernandez, CJimenez, AHornback, WJNisenbaum, ES A novel class of positive allosteric modulators of AMPA receptors: design, synthesis, and structure-activity relationships of 3-biphenyl-4-yl-4-cyano-5-ethyl-1-methyl-1H-pyrrole-2-carboxylic acid, LY2059346. Bioorg Med Chem Lett 16:5203-6 (2006)  
Target
Name:
Glutamate receptor 2
Synonyms:
AMPA-selective glutamate receptor 2 GRIA2 GluR-2 GluR-K2 Glutamate receptor 2 Glutamate receptor AMPA 2/3 Glutamate receptor ionotropic, AMPA 2
Type:
Enzyme Catalytic Domain
Mol. Mass.:
98825.96
Organism:
Homo sapiens (Human)
Description:
Glutamate AMPA 2 GRIA2 HUMAN::P42262
Residue:
883
  
Inhibitor
Name:
BDBM50191956
Synonyms:
3-(4'-chloro-biphenyl-4-yl)-4-cyano-5-ethyl-1-methyl-1H-pyrrole-2-carboxylic acid | CHEMBL385652
Type:
Small organic molecule
Emp. Form.:
C21H17ClN2O2
Mol. Mass.:
364.825
SMILES:
CCc1c(C#N)c(c(C(O)=O)n1C)-c1ccc(cc1)-c1ccc(Cl)cc1
: