Target
Glutamate receptor 4
Ligand
BDBM50094024
Substrate
Meas. Tech.
ChEMBL_391775 (CHEMBL869262)
EC50
420±n/a nM
Citation
 Fernandez, MCCastaño, ADominguez, EEscribano, AJiang, DJimenez, AHong, EHornback, WJNisenbaum, ESRankl, NTromiczak, EVaught, GZarrinmayeh, HZimmerman, DM A novel class of AMPA receptor allosteric modulators. Part 1: design, synthesis, and SAR of 3-aryl-4-cyano-5-substituted-heteroaryl-2-carboxylic acid derivatives. Bioorg Med Chem Lett 16:5057-61 (2006)  
Target
Name:
Glutamate receptor 4
Synonyms:
GLUR4 GRIA4_HUMAN Glutamate receptor ionotropic AMPA | Glutamate receptor ionotropic, AMPA 4
Type:
PROTEIN
Mol. Mass.:
100881.87
Organism:
Homo sapiens (Human)
Description:
ChEMBL_468628
Residue:
902
  
Inhibitor
Name:
BDBM50094024
Synonyms:
(+/-) Propane-2-sulfonic acid [2-(4'-cyano-biphenyl-4-yl)-propyl]-amide propane-2-sulfonic acid [2-(4'-cyano-biphenyl-4-yl)-propyl]-amide
Type:
Small organic molecule
Emp. Form.:
C19H22N2O2S
Mol. Mass.:
342.455
SMILES:
CC(C)S(=O)(=O)NCC(C)c1ccc(cc1)-c1ccc(cc1)C#N
: