Target
Glutamate receptor 2
Ligand
BDBM50192220
Substrate
Meas. Tech.
ChEMBL_391778 (CHEMBL871565)
EC50
>3000±n/a nM
Citation
 Fernandez, MCCastaño, ADominguez, EEscribano, AJiang, DJimenez, AHong, EHornback, WJNisenbaum, ESRankl, NTromiczak, EVaught, GZarrinmayeh, HZimmerman, DM A novel class of AMPA receptor allosteric modulators. Part 1: design, synthesis, and SAR of 3-aryl-4-cyano-5-substituted-heteroaryl-2-carboxylic acid derivatives. Bioorg Med Chem Lett 16:5057-61 (2006)  
Target
Name:
Glutamate receptor 2
Synonyms:
AMPA-selective glutamate receptor 2 GRIA2 GluR-2 GluR-K2 Glutamate receptor 2 Glutamate receptor AMPA 2/3 Glutamate receptor ionotropic, AMPA 2
Type:
Enzyme Catalytic Domain
Mol. Mass.:
98825.96
Organism:
Homo sapiens (Human)
Description:
Glutamate AMPA 2 GRIA2 HUMAN::P42262
Residue:
883
  
Inhibitor
Name:
BDBM50192220
Synonyms:
CHEMBL384175 | ethyl 3-(4-tert-butylphenyl)-4-cyano-5-(methylthio)thiophene-2-carboxylate
Type:
Small organic molecule
Emp. Form.:
C19H21NO2S2
Mol. Mass.:
359.506
SMILES:
CCOC(=O)c1sc(SC)c(C#N)c1-c1ccc(cc1)C(C)(C)C
: