Target
Glutamate receptor 2
Ligand
BDBM50192221
Substrate
Meas. Tech.
ChEMBL_391777 (CHEMBL871564)
EC50
78±n/a nM
Citation
 Fernandez, MCCastaño, ADominguez, EEscribano, AJiang, DJimenez, AHong, EHornback, WJNisenbaum, ESRankl, NTromiczak, EVaught, GZarrinmayeh, HZimmerman, DM A novel class of AMPA receptor allosteric modulators. Part 1: design, synthesis, and SAR of 3-aryl-4-cyano-5-substituted-heteroaryl-2-carboxylic acid derivatives. Bioorg Med Chem Lett 16:5057-61 (2006)  
Target
Name:
Glutamate receptor 2
Synonyms:
AMPA-selective glutamate receptor 2 GRIA2 GluR-2 GluR-K2 Glutamate receptor 2 Glutamate receptor AMPA 2/3 Glutamate receptor ionotropic, AMPA 2
Type:
Enzyme Catalytic Domain
Mol. Mass.:
98825.96
Organism:
Homo sapiens (Human)
Description:
Glutamate AMPA 2 GRIA2 HUMAN::P42262
Residue:
883
  
Inhibitor
Name:
BDBM50192221
Synonyms:
3-(4-tert-butylphenyl)-4-cyano-5-(trifluoromethyl)thiophene-2-carboxylic acid | CHEMBL214834
Type:
Small organic molecule
Emp. Form.:
C17H14F3NO2S
Mol. Mass.:
353.359
SMILES:
CC(C)(C)c1ccc(cc1)-c1c(sc(c1C#N)C(F)(F)F)C(O)=O
: