Target
Angiopoietin-1 receptor
Ligand
BDBM50192709
Substrate
Meas. Tech.
ChEMBL_422205 (CHEMBL856491)
IC50
2±n/a nM
Citation
 Becknell, NCZulli, ALAngeles, TSYang, SAlbom, MSAimone, LDRobinson, CChang, HHudkins, RL Novel C-3 N-urea, amide, and carbamate dihydroindazolo[5,4-a]pyrrolo[3,4-c]carbazole analogs as potent TIE-2 and VEGF-R2 dual inhibitors. Bioorg Med Chem Lett 16:5368-72 (2006)  
Target
Name:
Angiopoietin-1 receptor
Synonyms:
TEK TIE2_HUMAN Tyrosine-protein kinase receptor (TIE-2) Tyrosine-protein kinase receptor TEK (p140 TEK) Tyrosine-protein kinase receptor TIE2/TEK VMCM1 p140 TEK
Type:
Enzyme
Mol. Mass.:
125835.70
Organism:
Homo sapiens (Human)
Description:
Q02763
Residue:
1124
  
Inhibitor
Name:
BDBM50192709
Synonyms:
1-(3-fluorophenyl)-3-{19-methyl-14-oxo-3-propyl-3,13,19,20-tetraazahexacyclo[14.7.0.0^{2,10}.0^{4,9}.0^{11,15}.0^{17,21}]tricosa-1(16),2(10),4,6,8,11(15),17,20-octaen-7-yl}urea | CHEMBL426528
Type:
Small organic molecule
Emp. Form.:
C30H27FN6O2
Mol. Mass.:
522.5728
SMILES:
CCCn1c2ccc(NC(=O)Nc3cccc(F)c3)cc2c2c3CNC(=O)c3c3-c4cn(C)nc4CCc3c12
: