Target
Vitamin K-dependent protein C
Ligand
BDBM50193228
Substrate
Meas. Tech.
ChEMBL_381887 (CHEMBL870370)
IC50
1120±n/a nM
Citation
 De Nanteuil, GGloanec, PBéguin, SGiesen, PLHemker, HCMennecier, PRupin, AVerbeuren, TJ Low molecular weight activated protein C inhibitors as a potential treatment for hemophilic disorders. J Med Chem 49:5047-50 (2006)  
Target
Name:
Vitamin K-dependent protein C
Synonyms:
Activated protein C cofactor Apolipoprotein H Blood coagulation factor XIV Coagulation factor V heavy chain Endothelial protein C receptor PROC_HUMAN Vitamin K-dependent protein C precursor
Type:
Enzyme
Mol. Mass.:
52067.73
Organism:
Homo sapiens (Human)
Description:
Residue:
461
  
Inhibitor
Name:
BDBM50193228
Synonyms:
CHEMBL215556 | {(R)-1-[2-(4-carbamimidoyl-benzylcarbamoyl)-indan-2-ylcarbamoyl]-3-methyl-pentylamino}-acetic acid
Type:
Small organic molecule
Emp. Form.:
C27H35N5O4
Mol. Mass.:
493.5979
SMILES:
CCC(C)C[C@@H](NCC(O)=O)C(=O)NC1(Cc2ccccc2C1)C(=O)NCc1ccc(cc1)C(N)=N
: