Target
Lysophosphatidic acid receptor 3
Ligand
BDBM50193517
Substrate
Meas. Tech.
ChEMBL_385203 (CHEMBL868015)
Ki
636±n/a nM
Citation
 Xu, YJiang, GTsukahara, RFujiwara, YTigyi, GPrestwich, GD Phosphonothioate and fluoromethylene phosphonate analogues of cyclic phosphatidic acid: Novel antagonists of lysophosphatidic acid receptors. J Med Chem 49:5309-15 (2006)  
Target
Name:
Lysophosphatidic acid receptor 3
Synonyms:
EDG7 LPAR3 Lysophosphatidic acid receptor 1/3 Lysophosphatidic acid receptor Edg-7
Type:
Enzyme
Mol. Mass.:
40149.72
Organism:
Homo sapiens (Human)
Description:
Q9UBY5
Residue:
353
  
Inhibitor
Name:
BDBM50193517
Synonyms:
3-hydroxyl-4-oleoyloxylbutane 1,3-cyclic phosphonothioate | CHEMBL212029
Type:
Small organic molecule
Emp. Form.:
C22H43O4PS
Mol. Mass.:
434.613
SMILES:
CCCCCCCCCCCCCCCCCC(=O)OCC1CCP(O)(=S)O1
: