Target
Sterol O-acyltransferase 2
Ligand
BDBM50175019
Substrate
Meas. Tech.
ChEMBL_424061 (CHEMBL855070)
IC50
75200±n/a nM
Citation
 Park, KHPark, YDHan, JMIm, KRLee, BWJeong, IYJeong, TSLee, WS Anti-atherosclerotic and anti-inflammatory activities of catecholic xanthones and flavonoids isolated from Cudrania tricuspidata. Bioorg Med Chem Lett 16:5580-3 (2006)  
Target
Name:
Sterol O-acyltransferase 2
Synonyms:
ACACT2 ACAT2 Acetyl-CoA transferase-like protein Cholesterol acyltransferase 2 SOAT2 | SOAT2_HUMAN
Type:
Enzyme
Mol. Mass.:
59912.75
Organism:
Homo sapiens (Human)
Description:
O75908
Residue:
522
  
Inhibitor
Name:
BDBM50175019
Synonyms:
2,3,8-trihydroxy-6-methoxy-1-(3-methylbut-2-enyl)-5-(2-methylbut-3-en-2-yl)-9H-xanthen-9-one cudraxanthone D
Type:
Small organic molecule
Emp. Form.:
C24H26O6
Mol. Mass.:
410.4596
SMILES:
[#6]-[#8]-c1cc(-[#8])c2c(oc3cc(-[#8])c(-[#8])c(-[#6]\[#6]=[#6](\[#6])-[#6])c3c2=O)c1C([#6])([#6])[#6]=[#6]
: