Target
Sodium-dependent noradrenaline transporter
Ligand
BDBM50193766
Substrate
Meas. Tech.
ChEMBL_424087 (CHEMBL855090)
Ki
1379±n/a nM
Citation
 Watson, PSJiang, BHarrison, KAsakawa, NWelch, PKCovington, MStowell, NCWadman, EADavies, PSolomon, KANewton, RCTrainor, GLFriedman, SMDecicco, CPKo, SS 2,4-Disubstituted piperidines as selective CC chemokine receptor 3 (CCR3) antagonists: synthesis and selectivity. Bioorg Med Chem Lett 16:5695-9 (2006)  
Target
Name:
Sodium-dependent noradrenaline transporter
Synonyms:
Monoamine transporter NET Noradrenaline Transporter (NET) Norepinephrine transporter protein (NET) SLC6A2 Sodium-dependent noradrenaline transporter (NET) | Solute carrier family 6 member 2
Type:
Multi-pass membrane protein
Mol. Mass.:
69337.72
Organism:
Homo sapiens (Human)
Description:
P23975
Residue:
617
  
Inhibitor
Name:
BDBM50193766
Synonyms:
1-(3-((2S,4R)-4-(4-fluorobenzyl)-1-acetylpiperidin-2-yl)propyl)-3-(3,5-diacetylphenyl)urea | CHEMBL383879
Type:
Small organic molecule
Emp. Form.:
C28H34FN3O4
Mol. Mass.:
495.5857
SMILES:
CC(=O)N1CC[C@@H](Cc2ccc(F)cc2)C[C@@H]1CCCNC(=O)Nc1cc(cc(c1)C(C)=O)C(C)=O
: