Target
Histamine H3 receptor
Ligand
BDBM50194202
Substrate
Meas. Tech.
ChEMBL_393873 (CHEMBL912689)
Ki
5.3±n/a nM
Citation
 Watanabe, MKazuta, YHayashi, HYamada, SMatsuda, AShuto, S Stereochemical diversity-oriented conformational restriction strategy. Development of potent histamine H3 and/or H4 receptor antagonists with an imidazolylcyclopropane structure. J Med Chem 49:5587-96 (2006)  
Target
Name:
Histamine H3 receptor
Synonyms:
G-protein coupled receptor 97 HH3R HRH3 Histamine H3 receptor (H3) Histamine receptor (H3 and H4)
Type:
G Protein-Coupled Receptor (GPCR)
Mol. Mass.:
48691.47
Organism:
Homo sapiens (Human)
Description:
Binding assays were using CHO cells stably expressing hH3R receptors.
Residue:
445
  
Inhibitor
Name:
BDBM50194202
Synonyms:
(1S,2R)-trans-2-[2-(cyclohexylmethylamino)ethyl]-1-(1H-imidazol-4-yl)cyclopropane | CHEMBL214312
Type:
Small organic molecule
Emp. Form.:
C15H25N3
Mol. Mass.:
247.3791
SMILES:
C(C[C@H]1C[C@@H]1c1cnc[nH]1)NCC1CCCCC1
: