Target
Potassium voltage-gated channel subfamily A member 5
Ligand
BDBM50194526
Substrate
Meas. Tech.
ChEMBL_422064 (CHEMBL907690)
IC50
341±n/a nM
Citation
 Nanda, KKNolt, MBCato, MJKane, SAKiss, LSpencer, RHWang, JLynch, JJRegan, CPStump, GLLi, BWhite, RYeh, SBogusky, MJBilodeau, MTDinsmore, CJLindsley, CWHartman, GDWolkenberg, SETrotter, BW Potent antagonists of the Kv1.5 potassium channel: synthesis and evaluation of analogous N,N-diisopropyl-2-(pyridine-3-yl)acetamides. Bioorg Med Chem Lett 16:5897-901 (2006)  
Target
Name:
Potassium voltage-gated channel subfamily A member 5
Synonyms:
HK2 KCNA5 Potassium voltage-gated channel subfamily A member 5 Voltage-gated potassium channel subunit Kv1.5
Type:
Enzyme
Mol. Mass.:
67222.47
Organism:
Homo sapiens (Human)
Description:
P22460
Residue:
613
  
Inhibitor
Name:
BDBM50194526
Synonyms:
4-(3-(3-fluorobenzyl)ureido)-N,N-diisopropyl-3-phenyl-2-(pyridin-3-yl)butanamide | CHEMBL385662
Type:
Small organic molecule
Emp. Form.:
C29H35FN4O2
Mol. Mass.:
490.6122
SMILES:
CC(C)N(C(C)C)C(=O)C(C(CNC(=O)NCc1cccc(F)c1)c1ccccc1)c1cccnc1
: