Target
Peroxisome proliferator-activated receptor alpha
Ligand
BDBM50194624
Substrate
Meas. Tech.
ChEMBL_396482 (CHEMBL911536)
IC50
10897±n/a nM
Citation
 Xu, YEtgen, GJBroderick, CLCanada, EGonzalez, ILamar, JMontrose-Rafizadeh, COldham, BAOsborne, JJXie, CShi, QWinneroski, LLYork, JYumibe, NZink, RMantlo, N Design and synthesis of dual peroxisome proliferator-activated receptors gamma and delta agonists as novel euglycemic agents with a reduced weight gain profile. J Med Chem 49:5649-52 (2006)  
Target
Name:
Peroxisome proliferator-activated receptor alpha
Synonyms:
NR1C1 PPAR PPAR-alpha PPARA_HUMAN Peroxisome proliferator-activated receptor | Peroxisome proliferator-activated receptor alpha (PPAR alpha)
Type:
Enzyme
Mol. Mass.:
52222.08
Organism:
Homo sapiens (Human)
Description:
Q07869
Residue:
468
  
Inhibitor
Name:
BDBM50194624
Synonyms:
3-{4-[3-(2-benzyl-4-ethyl-phenoxy)-butoxy]-2-methyl-phenyl}-propionic acid | CHEMBL212591
Type:
Small organic molecule
Emp. Form.:
C29H34O4
Mol. Mass.:
446.5779
SMILES:
CCc1ccc(OC(C)CCOc2ccc(CCC(O)=O)c(C)c2)c(Cc2ccccc2)c1
: