Target
Peroxisome proliferator-activated receptor gamma
Ligand
BDBM28681
Substrate
Meas. Tech.
ChEMBL_396484 (CHEMBL911538)
IC50
67±n/a nM
Citation
 Xu, YEtgen, GJBroderick, CLCanada, EGonzalez, ILamar, JMontrose-Rafizadeh, COldham, BAOsborne, JJXie, CShi, QWinneroski, LLYork, JYumibe, NZink, RMantlo, N Design and synthesis of dual peroxisome proliferator-activated receptors gamma and delta agonists as novel euglycemic agents with a reduced weight gain profile. J Med Chem 49:5649-52 (2006)  
Target
Name:
Peroxisome proliferator-activated receptor gamma
Synonyms:
NR1C3 PPAR-gamma PPARG_HUMAN Peroxisome proliferator-activated receptor gamma (PPAR gamma) Peroxisome proliferator-activated receptor gamma (PPARĪ³) peroxisome proliferator-activated receptor gamma isoform 2
Type:
Nuclear Receptor
Mol. Mass.:
57613.46
Organism:
Homo sapiens (Human)
Description:
P37231
Residue:
505
  
Inhibitor
Name:
BDBM28681
Synonyms:
5-[(4-{2-[methyl(pyridin-2-yl)amino]ethoxy}phenyl)methyl]-1,3-thiazolidine-2,4-dione BRL 49653 CHEMBL121 [3H]rosiglitazone rosiglitazone
Type:
radiolabeled ligand
Emp. Form.:
C18H19N3O3S
Mol. Mass.:
357.427
SMILES:
CN(CCOc1ccc(Cc2sc(=O)[nH]c2O)cc1)c1ccccn1
: