Target
Muscarinic acetylcholine receptor M3
Ligand
BDBM50194642
Substrate
Meas. Tech.
ChEMBL_395698 (CHEMBL909206)
Ki
0.51±n/a nM
Citation
 Sagara, YSagara, TUchiyama, MOtsuki, SKimura, TFujikawa, TNoguchi, KOhtake, N Identification of a novel 4-aminomethylpiperidine class of M3 muscarinic receptor antagonists and structural insight into their M3 selectivity. J Med Chem 49:5653-63 (2006)  
Target
Name:
Muscarinic acetylcholine receptor M3
Synonyms:
ACM3_HUMAN Cholinergic, muscarinic M3 Muscarinic receptor M3 | RecName: Full=Muscarinic acetylcholine receptor M3
Type:
Enzyme
Mol. Mass.:
66151.03
Organism:
Homo sapiens (Human)
Description:
P20309
Residue:
590
  
Inhibitor
Name:
BDBM50194642
Synonyms:
(2R)-1-((2S,4R)-4-hydroxy-1-[3,3,3-tris(4-fluorophenyl)propanoyl]pyrrolidine -2-yl)-carbonyl-N-(1-methyl-4-piperidinylmethyl)pyrrolidine-2-carboxamide | CHEMBL214342
Type:
Small organic molecule
Emp. Form.:
C38H43F3N4O4
Mol. Mass.:
676.7676
SMILES:
CN1CCC(CNC(=O)[C@H]2CCCN2C(=O)[C@@H]2C[C@@H](O)CN2C(=O)CC(c2ccc(F)cc2)(c2ccc(F)cc2)c2ccc(F)cc2)CC1
: